{"text_format":"1","workbook":"xlsx","n_sheets":11,"sheets":["Water calculator","Front end","calculation","lookup tables","Output","Assumptions","Data extract","Sheet2","Activity database from wat 01","logic tree","Sheet1"],"not_rendered":{"charts":1,"images":4,"macros":1,"external_links":0,"defined_names":6,"comments":5,"pivot_tables":0},"unopened":[],"bounds":{"document_bytes":16777216,"sheet_cells":100000,"rows_first":2000,"rows_last":500,"rows_between":2000,"halvings":0,"cell_chars":16384,"cell_head_chars":4096},"cells_cut":0,"cells_raw":0,"read":"whole","date_system":"1900"}

{"sheet":"Water calculator","index":0,"n_rows":333,"n_cols":5,"rows_kept":333,"cut":false,"hidden":false,"merged":[]}
[]
[]
[]
[]
[]
[]
[]
[]
[]
[]
{"$rows_left_out":324}
{"sheet":"Front end","index":1,"n_rows":360,"n_cols":8,"rows_kept":360,"cut":false,"hidden":true,"merged":[]}
[null,null,"Mandatory data entry","Mandatory data entry - predicted water use"]
[null,null,"Conditonal data entry"]
[null,null,"Optional data entry"]
[]
[]
["Heading","Question ID","Conditional criteria","Question","Answers","Data entry permitted",null,"warning"]
["Building details"]
["Building type",1,"Mandatory","What is the building type?",null,"Selected from building type lookup table"]
["Floor area",2,"Mandatory","What is the building floor area in m2",null,"Enter a positive number >=0 to 2dps"]
["Number of occupants",3,"Mandatory - Predicted water use","What is the estimated number of occupants (during occupied hours)",null,"Enter a positive number >=0 to 2dps"]
{"$rows_left_out":351}
{"sheet":"calculation","index":2,"n_rows":75,"n_cols":33,"rows_kept":75,"cut":false,"hidden":true,"merged":[[19,16,19,23],[19,24,19,31],[52,16,52,23],[52,24,52,31]]}
[]
[]
[null,null,null,"BASELINE","From user data entry","Baseline values * adjustment factor",null,"takes account of alternative options (WC/urinal and shower/bath) and also typical % bath fill and tap full volume","from building type lookup","from building type lookup (for total building or food prepar","from building type lookup","volume* factor*uses per day (div occupant density for fixed uses","lt per person*occupancy density*m2 (Total or food preparation as approprite)","lt/m2*1,000/ occupied days per year","m3/m2/year*m2"]
[null,null,null,null,"number of items","Average water use ltrs","Unit","Adjustment factor","Use per day","occupancy density","occupied days per year","lt per person per day","lt/m2 per day","m3/m2 per year","m3/year"]
["uses per person per day","people related usage",null,"WC",{"$f":"+E22","v":0},{"$f":"+'lookup tables'!D35*H5","v":6},"per use",{"$f":"+H22","v":1},{"$f":"VLOOKUP('Front end'!E$8,'lookup tables'!$C$7:$O$30,6,FALSE)","v":{"$error":"#N/A"}},{"$f":"J55","v":{"$error":"#DIV/0!"}},{"$f":"+'Front end'!$E$11","v":0},{"$f":"+F5*I5","v":{"$error":"#N/A"}},{"$f":"+J5*L5","v":{"$error":"#DIV/0!"}},{"$f":"+M5/1000*K5","v":{"$error":"#DIV/0!"}},{"$f":"+N5*'Front end'!E$9","v":{"$error":"#DIV/0!"}}]
["uses per person per day","people related usage",null,"Urinals",{"$f":"+E23+E24+E25","v":0},{"$f":"+'Activity database from wat 01'!C113*H6","v":7.5},"per hour",1,{"$f":"VLOOKUP('Front end'!E$8,'lookup tables'!$C$7:$O$30,5,FALSE)","v":{"$error":"#N/A"}},{"$f":"J56","v":{"$error":"#DIV/0!"}},{"$f":"+'Front end'!$E$11","v":0},{"$f":"+F6*I6/(J6*'Front end'!$E$9)","v":{"$error":"#N/A"}},{"$f":"+J6*L6","v":{"$error":"#DIV/0!"}},{"$error":"#DIV/0!"},{"$f":"+N6*'Front end'!E$9","v":{"$error":"#DIV/0!"}}]
["uses per person per day","people related usage",null,"Wash hand basin tap",{"$f":"+E26","v":0},{"$f":"+'Activity database from wat 01'!C110*H7","v":0},"per use",{"$f":"+H24","v":0},{"$f":"VLOOKUP('Front end'!E$8,'lookup tables'!$C$7:$O$30,8,FALSE)","v":{"$error":"#N/A"}},{"$error":"#DIV/0!"},{"$f":"+'Front end'!$E$11","v":0},{"$f":"+F7*I7","v":{"$error":"#N/A"}},{"$error":"#DIV/0!"},{"$error":"#DIV/0!"},{"$f":"+N7*'Front end'!E$9","v":{"$error":"#DIV/0!"}}]
["uses per person per day","people related usage",null,"Shower",0,{"$f":"+'Activity database from wat 01'!C111*calculation!H8","v":0},"per use",0,{"$f":"VLOOKUP('Front end'!E$8,'lookup tables'!$C$7:$O$30,9,FALSE)","v":{"$error":"#N/A"}},{"$error":"#DIV/0!"},{"$f":"+'Front end'!$E$11","v":0},{"$error":"#N/A"},{"$error":"#DIV/0!"},{"$error":"#DIV/0!"},{"$f":"+N8*'Front end'!E$9","v":{"$error":"#DIV/0!"}}]
["uses per person per day","people related usage",null,"Bath",0,{"$f":"+'Activity database from wat 01'!C112*calculation!H9","v":0},"per use",0,{"$f":"VLOOKUP('Front end'!E$8,'lookup tables'!$C$7:$O$30,10,FALSE)","v":{"$error":"#N/A"}},{"$error":"#DIV/0!"},{"$f":"+'Front end'!$E$11","v":0},{"$error":"#N/A"},{"$error":"#DIV/0!"},{"$error":"#DIV/0!"},{"$f":"+N9*'Front end'!E$9","v":{"$error":"#DIV/0!"}}]
["uses per person per day","people related usage",null,"Kitchen taps: kitchenette",0,{"$f":"+'Activity database from wat 01'!C117*calculation!H10","v":10},"per use",1,{"$f":"VLOOKUP('Front end'!E$8,'lookup tables'!$C$7:$O$30,11,FALSE)","v":{"$error":"#N/A"}},{"$error":"#DIV/0!"},{"$f":"+'Front end'!$E$11","v":0},{"$error":"#N/A"},{"$error":"#DIV/0!"},{"$error":"#DIV/0!"},{"$f":"+N10*'Front end'!E$9","v":{"$error":"#DIV/0!"}}]
{"$rows_left_out":66}
{"sheet":"lookup tables","index":3,"n_rows":66,"n_cols":19,"rows_kept":66,"cut":false,"hidden":true,"merged":[]}
[null,null,null,"From Wat 01 activity database"]
[null,null,null,"New Assumption"]
[null,null,null,"Derived from Wat 01 activity database"]
[null,null,null,null,null,null,"usage per person per day","usage per person per day","usage per person per day","usage per person per day","usage per person per day","usage minutes per person per day","usage per person per day","usage per person per day","usage per person per day","per minute","per minute","usage per person per day"]
["water storage capacity calculation","Yes/No","Building type lookup","Occupant density (people per m2 per year)","Occupant density (food prepartion area","Number of days","occupancy hours per day","WC","Urinal","Wash hand basin tap","Shower","Bath","Kitchen taps: kitchenette","Domestic sized washing machines","Domestic sized dishwashers","Kitchen taps: restaurant (pre-rinse nozzles only)","Waste disposal unit (commercial kitchens only)","Commercial sized dishwashers","Commercial or industrial sized washing machines"]
[null,null,null,null,null,null,null,"uses per day","uses per day","uses per day","uses per day","uses per day","uses per day","uses per day","uses per day","per day (fixed use)","per day (fixed use)","per day (fixed use)","per day (fixed use)"]
["BS EN 16941-1:2018 'basic approach'","Yes","Retail",3.7258928571428575E-2,3.7258928571428575E-2,{"$f":"+'Activity database from wat 01'!D34","v":362},{"$f":"+'Activity database from wat 01'!E34","v":13},{"$f":"+'Activity database from wat 01'!K34","v":0.85184051840518404},{"$f":"+'Activity database from wat 01'!L34","v":0.70479497794977952},{"$f":"+'Activity database from wat 01'!M34","v":0.85184051840518404},{"$f":"+'Activity database from wat 01'!N34","v":4.8600486004860038E-4},{"$f":"+K7","v":4.8600486004860038E-4},{"$f":"+'Activity database from wat 01'!R46","v":1.6200162001620014E-2},{"$f":"+'Activity database from wat 01'!U46","v":6.4800648006480054E-4},6.4800648006480054E-4,{"$f":"+'Activity database from wat 01'!AI47","v":60},{"$f":"+'Activity database from wat 01'!AM47","v":30},20,3]
["BS EN 16941-1:2018 'detailed approach'","No","Retail services",{"$f":"+D7","v":3.7258928571428575E-2},{"$f":"+E7","v":3.7258928571428575E-2},{"$f":"+'Activity database from wat 01'!D37","v":304},{"$f":"+'Activity database from wat 01'!E37","v":8},{"$f":"+H7","v":0.85184051840518404},{"$f":"+I7","v":0.70479497794977952},0.85184051840518404,4.8600486004860038E-4,4.8600486004860038E-4,1.6200162001620014E-2,6.4800648006480054E-4,6.4800648006480054E-4,{"$f":"+P7","v":60},{"$f":"+Q7","v":30},20,3]
[null,null,"Restaurant and Cafes/Drinking Establishments and Hot Food takeaways",6.637916666666667E-2,6.637916666666667E-2,{"$f":"+F8","v":304},{"$f":"+G8","v":8},{"$f":"+H10","v":4},{"$f":"+I10","v":3},4,0.03,0.03,1,0.04,0.04,{"$f":"+P8","v":60},{"$f":"+Q8","v":30},{"$f":"+R8","v":20},3]
[null,null,"Office",4.2656597222083335E-2,4.2656597222083335E-2,{"$f":"+'Activity database from wat 01'!D4","v":253},{"$f":"+'Activity database from wat 01'!E10","v":10},4,3,4,0.03,{"$f":"+K10","v":0.03},1,{"$f":"1/25","v":0.04},0.04,60,30,20,3]
{"$rows_left_out":57}
{"sheet":"Output","index":4,"n_rows":64,"n_cols":15,"rows_kept":64,"cut":false,"hidden":true,"merged":[[15,1,15,9],[16,1,16,9],[17,1,17,9],[20,1,20,9],[0,1,1,10],[5,2,5,9],[3,2,3,9],[4,2,4,9],[6,2,6,9],[7,2,7,9],[10,1,10,9],[11,1,11,9],[12,1,12,9],[13,1,13,9],[14,1,14,9],[62,1,62,9],[63,1,63,9],[48,1,48,9],[49,1,49,9],[50,1,50,9],[51,1,51,9],[59,1,59,9],[52,1,52,9],[53,1,53,9],[54,1,54,9],[55,1,55,9],[56,1,56,9],[23,11,23,12],[24,11,26,12],[24,13,26,13],[60,1,60,9],[61,1,61,9],[47,1,47,9],[40,1,40,4],[29,3,29,9],[41,1,41,4],[42,1,42,4],[43,1,43,4],[44,1,44,4],[23,1,24,1],[23,2,23,9]]}
[{"$f":"'Water calculator'!A44","v":"Versie:"},"BREEAM-NL Nieuwbouw en Renovatie Utiliteit v6.1.1 - WAT 01 - Watercalculator"]
[{"$f":"'Water calculator'!A47","v":"1.3"}]
[]
[null,"Projectnaam:"]
[null,"Registratienummer:"]
[null,"Opdrachtgever:"]
[null,"BREEAM-NL Expert"]
[null,"BREEAM-NL Assessor"]
[]
[null,null,null,null,null,null,null,null,null,null,null,"Percentage verbetering:",{"$f":"_xlfn.IFS(M11=\"EP behaald\",\"EP-Score\",M11=\" \",\" \")","v":{"$error":"#N/A"}}]
{"$rows_left_out":55}
{"sheet":"Assumptions","index":5,"n_rows":58,"n_cols":7,"rows_kept":58,"cut":false,"hidden":true,"merged":[]}
[]
[]
[{"$f":"0.5*6/7","v":0.42857142857142855},"assume urinals get used in preference to toilets 45% of the time (50% male & a ratio of 7:1 urine:stool)",null,null,null,null,"https://www.medicalnewstoday.com/articles/321461"]
[0.78,"preference for showers over baths where both are installed",null,null,null,"https://www.independent.co.uk/life-style/health-and-families/health-news/shower-bath-choice-victorian-plumbing-survey-results-a8845946.html"]
[0.4,"typical fill of max bath capacity"]
[{"$f":"+'Activity database from wat 01'!AR37","v":0.67700000000000005},"typical % of full flow rate for taps"]
[0.95,"percentage recovery grey water"]
[0.8,"percentage recovery black water"]
[]
[]
{"$rows_left_out":49}
{"sheet":"Data extract","index":6,"n_rows":0,"n_cols":0,"rows_kept":0,"cut":false,"hidden":true,"merged":[]}

{"sheet":"Sheet2","index":7,"n_rows":0,"n_cols":0,"rows_kept":0,"cut":false,"hidden":true,"merged":[]}

{"sheet":"Activity database from wat 01","index":8,"n_rows":129,"n_cols":58,"rows_kept":129,"cut":false,"hidden":true,"merged":[[1,6,1,7]]}
[1,2,3,4,5,6,7,8,9,10,11,12,13,14,15,16,17,18,19,20,21,22,23,24,25,26,27,28,29,30,31,32,33,34,35,36,37,38,39,40,41,42,43,44,null,1,2,3,4,5,6,7,8]
[null,null,"Building occupation data",null,null,"User","Gender ratio",null,"Component uses/person/day (unless stated differently for specific uses or activity areas)",null,null,null,null,null,null,null,null,null,null,null,null,null,null,null,null,null,"Usage factors",null,null,null,null,null,null,null,null,null,null,null,null,null,null,null,"Adjustment factors",null,null,"Microcomponent Performance Levels for BREEAM water consumption method benchmarking"]
["Building category and main activity area/function","Description","Occupant density (person/m2)","No. days/yr building occupied","default daily hrs of operation","Type","Ratio male users","Ratio female users","WC - male (urinals installed)","WC - male (no urinals installed)","WC - female","Urinal","Wash hand basin taps","Shower use","Shower use (bath present)","Bath use (no shower present) ","Bath use (shower present)","Kitchen taps - kitchenette","Kitchen taps - pre-rinse nozzle","blank column","Dishwasher","Washing machine","Waste disposal unit","Fixed use - vessel filling","Fixed use - food preparation","Fixed use - kitchen cleaning","WC (factor of use","Urinals (factor of use)","Wash hand basin taps (mins/use)","Showers (no bath present) - mins/use","Showers (bath present) mins/use","Bath (No shower present) ratio","Bath (shower present) ratio","Kitchen taps - kitchenette mins/day","Kitchen taps - pre-rinse nozzle","blank","Dishwasher","Washing machine","Waste dispoal unit","Fixed use - vessel filling","Fixed use - food preparation","Fixed use - kitchen cleaning","Baths","Taps",null,"Component","Baseline","Level 1","Level 2","Level 3","Level 4","Level 5","Unit",null,"BREEAM credit benchmarks",null,null,"Sources of data/information"]
["Office","TCP Classification B1: Offices and workshop business (including those with a basic (category 1) laboratory area)","-",253,10,"Staff",0.5,0.5,1,4,4,3,4,0.03,"N/A","N/A","N/A","-","-","-","-","N/A","-",1.58,"-","-",1,1,0.25,5.6,4.37,1,1,"-","-","-","-","-","-",1,"-","-",0.4,0.67700000000000005,null,"WC - male (urinals installed)",6,4.5,4,3.75,3.5,3,"Effective flush volume (litres)",null,0,"0 credits",null,"SD129: Certification and Listing of Low Flush WC appliances"]
["Office - Office areas","Cellular or open plan office space, including staff kitchen where present/adjacent and reception areas. Exlcude meeting rooms, visitor waiting or circulation areas.",0.111,null,null,null,null,null,null,null,null,null,null,null,null,null,null,1,null,null,0.04,null,null,null,null,null,null,null,null,null,null,null,null,0.67,null,null,1,"N/A",null,null,null,null,null,null,null,"WC - male (no urinals installed)",6,4.5,4,3.75,3.5,3,"Effective flush volume (litres)",null,0.125,"1 credit",null,"Waterwise "]
["Office - Staff canteen dining area","Seated dining areas that accompany a permanently staffed kitchen preparing food for consumption on the premises (excludes small un-staffed kitchen's used by office staff to re-heat food, make tea etc.)",4.3299999999999998E-2,null,null,null,null,null,null,null,null,null,null,null,null,null,null,null,"see usage factor",null,"see usage factor","N/A","see usage factor",null,5849.0006400000002,13810.991040000001,null,null,null,null,null,null,null,null,60,null,0.217,"N/A",30,null,1,1,null,null,null,"WC - female",6,4.5,4,3.75,3.5,3,"Effective flush volume (litres)",null,0.25,"2 credits",null,"Water efficient product labelling scheme"]
["Office - Small workshop / laboratory space","Small scale workshop or category 1 laboratory area",6.8000000000000005E-2,null,null,null,null,null,null,null,null,null,null,null,null,null,null,null,null,null,null,null,null,null,null,null,null,null,null,null,null,null,null,null,null,null,null,null,null,null,null,null,null,null,null,"Wash hand basin taps",10,8,6,5,4,3,"Volume (litres/min)",null,0.4,"3 credits",null,"Water Supply (water fittings) Regulations 1999: WC Suite Performance Specifications"]
["Office - Fitness suite/gym (with changing facility and showers)","A fitness suite or gym that is part of the office building/development  and used by the building's employees only. The gym will have its own changing facility with showers.",0,null,null,null,null,null,null,null,null,null,null,0.154,null,null,null,null,null,null,null,null,null,0.05,null,null,null,null,null,null,null,null,null,null,null,null,null,null,null,null,null,null,null,null,null,"Showers",12,10,8,6,5,3.5,"Volume (litres/min)",null,0.5,"4 credits",null,"(Very early) Draft BS8542"]
["Industrial - 24hr x 7 day operation","TCP Classification B2 to B8: general and specialist industrail and warehouse and storage units operating 24 hours a day 7 days a week.","-",365,24,"Staff",0.5,0.5,1,4,4,3,4,0.03,"N/A","N/A","N/A","-","-","-","-","N/A","-",1.58,"-","-",1,1,0.25,5.6,4.37,1,1,"-","-","-","-","-","-",1,"-","-",0.4,0.67700000000000005,null,"Baths",200,180,160,140,120,100,"Volume (litres)",null,0.55000000000000004,"5 credits",null,"SD174: Certification and Listing of Water Efficient Terminal Fittings (table 2.0)"]
["Industrial - typical business hours of operation","TCP Classification B2 to B8: general and specialist industrial and warehouse and storage units operating 24 hours a day 7 days a week.","-",253,10,"Staff",0.5,0.5,1,4,4,3,4,0.03,"N/A","N/A","N/A","-","-","-","-","N/A","-",1.58,"-","-",1,1,0.25,5.6,4.37,1,1,"-","-","-","-","-","-",1,"-","-",0.4,0.67700000000000005,null,"Urinal (2 or more urinals) - Automatically operated flushing cistern",7.5,6,3,1.5,0.75,0,"Volume (litres/bowl/hour)",null,0.65,"Exemplary level",null,"CLG Water Calculation Method for New Dwelling"]
{"$rows_left_out":120}
{"sheet":"logic tree","index":9,"n_rows":35,"n_cols":21,"rows_kept":35,"cut":false,"hidden":true,"merged":[[9,15,13,15],[9,19,13,19],[29,10,31,10],[29,12,30,12]]}
[]
[null,null,null,null,null,"Asset Water Caclulator"]
[]
[]
[]
[]
[null,null,null,null,null,"Has the building type been selected?","Building type determines annual usage rates for each component"]
[null,null,null,null,"N",null,"Y"]
[null,null,null,null,null,null,"Have installed water using components been selected?","Components present used to determine baseline and building water consumption",null,null,null,null,null,null,null,"Baseline water consumption",null,null,null,"Building water consumption"]
[null,null,null,null,null,"N",null,"Y",null,null,null,null,null,null,null,"Determined by \n- building type\n- water using components present\n- baseline water consumption values (fixed values)",null,null,null,"Determined by \n- building type\n- water consumption of installed components\nMinus\n- grey water use\n- rainwater use"]
{"$rows_left_out":26}
{"sheet":"Sheet1","index":10,"n_rows":96,"n_cols":58,"rows_kept":96,"cut":false,"hidden":true,"merged":[[1,6,1,7]]}
[1,2,3,4,5,6,7,8,9,10,11,12,13,14,15,16,17,18,19,20,21,22,23,24,25,26,27,28,29,30,31,32,33,34,35,36,37,38,39,40,41,42,43,44,null,1,2,3,4,5,6,7,8]
[null,null,"Building occupation data",null,null,"User","Gender ratio",null,"Component uses/person/day (unless stated differently for specific uses or activity areas)",null,null,null,null,null,null,null,null,null,null,null,null,null,null,null,null,null,"Usage factors",null,null,null,null,null,null,null,null,null,null,null,null,null,null,null,"Adjustment factors",null,null,"Microcomponent Performance Levels for BREEAM water consumption method benchmarking"]
["Building category and main activity area/function","Description","Occupant density (person/m2)","No. days/yr building occupied","default daily hrs of operation","Type","Ratio male users","Ratio female users","WC - male (urinals installed)","WC - male (no urinals installed)","WC - female","Urinal","Wash hand basin taps","Shower use","Shower use (bath present)","Bath use (no shower present) ","Bath use (shower present)","Kitchen taps - kitchenette","Kitchen taps - pre-rinse nozzle","blank column","Dishwasher","Washing machine","Waste disposal unit","Fixed use - vessel filling","Fixed use - food preparation","Fixed use - kitchen cleaning","WC (factor of use","Urinals (factor of use)","Wash hand basin taps (mins/use)","Showers (no bath present) - mins/use","Showers (bath present) mins/use","Bath (No shower present) ratio","Bath (shower present) ratio","Kitchen taps - kitchenette mins/day","Kitchen taps - pre-rinse nozzle","blank","Dishwasher","Washing machine","Waste dispoal unit","Fixed use - vessel filling","Fixed use - food preparation","Fixed use - kitchen cleaning","Baths","Taps",null,"Component","Baseline","Level 1","Level 2","Level 3","Level 4","Level 5","Unit",null,"BREEAM credit benchmarks",null,null,"Sources of data/information"]
["Office","TCP Classification B1: Offices and workshop business (including those with a basic (category 1) laboratory area)","-",253,10,"Staff",0.5,0.5,1,4,4,3,4,0.03,"N/A","N/A","N/A","-","-","-","-","N/A","-",1.58,"-","-",1,1,0.25,5.6,4.37,1,1,"-","-","-","-","-","-",1,"-","-",0.4,0.67700000000000005,null,"WC - male (urinals installed)",6,4.5,4,3.75,3.5,3,"Effective flush volume (litres)",null,0,"0 credits",null,"SD129: Certification and Listing of Low Flush WC appliances"]
["Office - Office areas","Cellular or open plan office space, including staff kitchen where present/adjacent and reception areas. Exlcude meeting rooms, visitor waiting or circulation areas.",0.111,null,null,null,null,null,null,null,null,null,null,null,null,null,null,1,null,null,0.04,null,null,null,null,null,null,null,null,null,null,null,null,0.67,null,null,1,"N/A",null,null,null,null,null,null,null,"WC - male (no urinals installed)",6,4.5,4,3.75,3.5,3,"Effective flush volume (litres)",null,0.125,"1 credit",null,"Waterwise "]
["Office - Staff canteen dining area","Seated dining areas that accompany a permanently staffed kitchen preparing food for consumption on the premises (excludes small un-staffed kitchen's used by office staff to re-heat food, make tea etc.)",4.3299999999999998E-2,null,null,null,null,null,null,null,null,null,null,null,null,null,null,null,"see usage factor",null,"see usage factor","N/A","see usage factor",null,5849.0006400000002,13810.991040000001,null,null,null,null,null,null,null,null,60,null,0.217,"N/A",30,null,1,1,null,null,null,"WC - female",6,4.5,4,3.75,3.5,3,"Effective flush volume (litres)",null,0.25,"2 credits",null,"Water efficient product labelling scheme"]
["Office - Small workshop / laboratory space","Small scale workshop or category 1 laboratory area",6.8000000000000005E-2,null,null,null,null,null,null,null,null,null,null,null,null,null,null,null,null,null,null,null,null,null,null,null,null,null,null,null,null,null,null,null,null,null,null,null,null,null,null,null,null,null,null,"Wash hand basin taps",10,8,6,5,4,3,"Volume (litres/min)",null,0.4,"3 credits",null,"Water Supply (water fittings) Regulations 1999: WC Suite Performance Specifications"]
["Office - Fitness suite/gym (with changing facility and showers)","A fitness suite or gym that is part of the office building/development  and used by the building's employees only. The gym will have its own changing facility with showers.",0,null,null,null,null,null,null,null,null,null,null,0.154,null,null,null,null,null,null,null,null,null,0.05,null,null,null,null,null,null,null,null,null,null,null,null,null,null,null,null,null,null,null,null,null,"Showers",12,10,8,6,5,3.5,"Volume (litres/min)",null,0.5,"4 credits",null,"(Very early) Draft BS8542"]
["Industrial - 24hr x 7 day operation","TCP Classification B2 to B8: general and specialist industrail and warehouse and storage units operating 24 hours a day 7 days a week.","-",365,24,"Staff",0.5,0.5,1,4,4,3,4,0.03,"N/A","N/A","N/A","-","-","-","-","N/A","-",1.58,"-","-",1,1,0.25,5.6,4.37,1,1,"-","-","-","-","-","-",1,"-","-",0.4,0.67700000000000005,null,"Baths",200,180,160,140,120,100,"Volume (litres)",null,0.55000000000000004,"5 credits",null,"SD174: Certification and Listing of Water Efficient Terminal Fittings (table 2.0)"]
["Industrial - typical business hours of operation","TCP Classification B2 to B8: general and specialist industrial and warehouse and storage units operating 24 hours a day 7 days a week.","-",253,10,"Staff",0.5,0.5,1,4,4,3,4,0.03,"N/A","N/A","N/A","-","-","-","-","N/A","-",1.58,"-","-",1,1,0.25,5.6,4.37,1,1,"-","-","-","-","-","-",1,"-","-",0.4,0.67700000000000005,null,"Urinal (2 or more urinals) - Automatically operated flushing cistern",7.5,6,3,1.5,0.75,0,"Volume (litres/bowl/hour)",null,0.65,"Exemplary level",null,"CLG Water Calculation Method for New Dwelling"]
{"$rows_left_out":86}